Acetamide, N,N-diphenyl-

Phase change data

Data compiled by: William E. Acree, Jr., James S. Chickos

Enthalpy of sublimation

ΔsubH (kJ/mol) Temperature (K) Method Reference Comment
122.7358.AStephenson and Malanowski, 1987Based on data from 343. - 376. K.

Enthalpy of fusion

ΔfusH (kJ/mol) Temperature (K) Reference
23.4374.4Jamróz, Dobrowolski, et al., 2001

Condensed phase thermochemistry data

Data compiled by: Hussein Y. Afeefy, Joel F. Liebman, and Stephen E. Stein

Quantity Value Units Method Reference Comment
Δfsolid-10.3 ± 1.7kcal/molCcbTavernier and Lamouroux, 1956Reanalyzed by Cox and Pilcher, 1970, Original value = -7.21 kcal/mol; Author's hf298_condensed=-13.99 kcal/mol
Quantity Value Units Method Reference Comment
Δcsolid-1750.5 ± 1.7kcal/molCcbTavernier and Lamouroux, 1956Reanalyzed by Cox and Pilcher, 1970, Original value = -1753.555 kcal/mol; Author's hf298_condensed=-13.99 kcal/mol

References

Stephenson and Malanowski, 1987
Stephenson, Richard M.; Malanowski, Stanislaw, Handbook of the Thermodynamics of Organic Compounds, 1987, https://doi.org/10.1007/978-94-009-3173-2 . [all data]

Jamróz, Dobrowolski, et al., 2001
Jamróz, Malgorzata E.; Dobrowolski, Jan Cz.; Polaczek, Jerzy; Szafranski, Andrzej M.; Kazimirski, Jan K.; Lisicki, Zygmunt, (Solid + liquid) equilibria, i.r., and semi-empirical studies of carbazole with selected tertiary amides, The Journal of Chemical Thermodynamics, 2001, 33, 5, 565-579, https://doi.org/10.1006/jcht.2000.0770 . [all data]