2-Methoxy-3-methyl-1-butene

Reaction thermochemistry data

Data compiled by: Hussein Y. Afeefy, Joel F. Liebman, and Stephen E. Stein

Individual Reactions

2-Methoxy-3-methyl-1-butene = 2-Butene, 2-methoxy-3-methyl-

By formula: C6H12O = C6H12O

Quantity Value Units Method Reference Comment
Δr9.46 ± 0.33kJ/molEqkTaskinen, 1975gas phase

References

Taskinen, 1975
Taskinen, E., Thermodynamics of vinyl ethers - XI. The effect of the alkoxy group on the relative stabilities of 2-alkoxy-3-mehyl-1-butenes and corresponding 2-butenes, Tetrahedron, 1975, 31, 957-962. [all data]