1-Chloro-2-methyl-2-phenylpropane

Gas phase ion energetics data

Data compiled by: Sharon G. Lias, John E. Bartmess, Joel F. Liebman, John L. Holmes, Rhoda D. Levin, and W. Gary Mallard

Ionization energy determinations

IE (eV) Method Reference
8.79PIDomnin, Lakshin, et al., 1985

Appearance energy determinations

Ion AE (eV) Other Products MethodReferenceComment
C9H11+9.41CH2ClPIDomnin, Lakshin, et al., 1985

References

Domnin, Lakshin, et al., 1985
Domnin, I.N.; Lakshin, A.M.; Misharev, A.D.; Orlov, V.M.; Takhistov, V.V., Thermochemical investigation of some hydrocarbon ions generated by photoionization, J. Org. Chem. USSR, 1985, 21, 1149. [all data]