1,1'-Biphenyl, 4-bromo-4'-methyl-

Phase change data

Data compiled by: Thermodynamics Research Center, NIST Boulder Laboratories, Chris Muzny director

Quantity Value Units Method Reference Comment
Tfus403.KN/ABenkeser, Schroeder, et al., 1958Uncertainty assigned by TRC = 4. K

In addition to the Thermodynamics Research Center (TRC) data available from this site, much more physical and chemical property data is available from the following TRC products:

References

Benkeser, Schroeder, et al., 1958
Benkeser, R.A.; Schroeder, W.; Thomas, O.H., Electrical Effects in the Biphenyl and Naphthalene Systems. The Influence of Alkyl Groups Attached to Silicon on Desilylation Reactions, J. Am. Chem. Soc., 1958, 80, 2283-7. [all data]