Aminopyrazine

Phase change data

Data compiled by: Thermodynamics Research Center, NIST Boulder Laboratories, Chris Muzny director

Quantity Value Units Method Reference Comment
Tfus392.5KN/ANakatani, Tohdo, et al., 1991Uncertainty assigned by TRC = 0.002 K

In addition to the Thermodynamics Research Center (TRC) data available from this site, much more physical and chemical property data is available from the following TRC products:

References

Nakatani, Tohdo, et al., 1991
Nakatani, T.; Tohdo, T.; Ohgaki, K.; Katayama, T., Solubilities of Pyliminidine and Pyrazine Derivatives in Supercritical Fluids, J. Chem. Eng. Data, 1991, 36, 314. [all data]