2,4-Cycloheptadien-1-one, 2,6,6-trimethyl-

Gas phase ion energetics data

Data compiled by: Henry M. Rosenstock, Keith Draxl, Bruce W. Steiner, and John T. Herron

Ionization energy determinations

IE (eV) Method Reference
9.62EIBunau, Schade, et al., 1967

Appearance energy determinations

Ion AE (eV) Other Products MethodReferenceComment
C9H11O+11.1CH3EIBunau, Schade, et al., 1967

References

Bunau, Schade, et al., 1967
Bunau, G.v.; Schade, G.; Gollnick, K., Massenspektrometrische Untersuchungen von Terpenen. I.Monoterpenaldehyde und -ketone, Z. Anal. Chem., 1967, 227, 173. [all data]