1H-Isoindole-1,3(2H)-dione, 2-(2,6-dioxo-3-piperidinyl)-

Phase change data

Data compiled by: William E. Acree, Jr., James S. Chickos

Enthalpy of fusion

ΔfusH (kJ/mol) Temperature (K) Reference
36.02548.2Goosen, Laing, et al., 2002

References

Goosen, Laing, et al., 2002
Goosen, Colleen; Laing, Timothy J.; Plessis, Jeanetta du; Goosen, Theunis C.; Flynn, Gordon L., Pharmaceutical Research, 2002, 19, 1, 13-19, https://doi.org/10.1023/A:1013643013244 . [all data]