16-Hentriacontanone

Phase change data

Data compiled as indicated in comments:
TRC - Thermodynamics Research Center, NIST Boulder Laboratories, Chris Muzny director
AC - William E. Acree, Jr., James S. Chickos

Quantity Value Units Method Reference Comment
Tfus356.4KN/ABoelhouwer, Nederbragt, et al., 1950Uncertainty assigned by TRC = 0.5 K; TRC

Enthalpy of fusion

ΔfusH (kJ/mol) Temperature (K) Reference Comment
117.1356.4Nakasone, Takamizawa, et al., 1994AC

In addition to the Thermodynamics Research Center (TRC) data available from this site, much more physical and chemical property data is available from the following TRC products:

References

Boelhouwer, Nederbragt, et al., 1950
Boelhouwer, J.W.M.; Nederbragt, G.W.; Verberg, G.W., Viscosity data of organic liquids, Appl. Sci. Res., Sect. A, 1950, 2, 249. [all data]

Nakasone, Takamizawa, et al., 1994
Nakasone, Keiko; Takamizawa, Kanichiro; Shiokawa, Kohzoh; Urabe, Yoshiko, Simultaneous determination of the heat capacity and the heat of the transitions for long-chain compounds with a heat-flux type DSC, Thermochimica Acta, 1994, 233, 2, 175-185, https://doi.org/10.1016/0040-6031(94)85110-7 . [all data]