1,3-Benzenediol, 5-pentyl-

Van Den Dool and Kratz RI, non-polar column, custom temperature program

View large format table.

Column type Active phase I Reference Comment
CapillaryVF-5MS1770.8Tret'yakov, 200730. m/0.25 mm/0.25 μm, He; Program: Multi-step temperature program; T(initial)=60C; T(final)=270C

Normal alkane RI, non-polar column, temperature ramp

View large format table.

Column type Active phase I Reference Comment
CapillaryDB-5 MS1755.Stojanovic, RAdulovic, et al., 201130. m/0.25 mm/0.25 μm, Helium, 5. K/min, 290. C @ 10. min; Tstart: 70. C

References

Tret'yakov, 2007
Tret'yakov, K.V., Retention Data. NIST Mass Spectrometry Data Center., NIST Mass Spectrometry Data Center, 2007. [all data]

Stojanovic, RAdulovic, et al., 2011
Stojanovic, I.Z.; RAdulovic, N.S.; Mitrovic, Y.L.J.; Stamenkovic, S.M.; Stojanovic, G.S., Volatile constituents of selected Parmeliaceae lichens, J. Serb. Chem. Soc., 2011, 76, 7, 987-994, https://doi.org/10.2298/JSC101004087S . [all data]