2,4,6-Tripicryltriazine

Phase change data

Data compiled by: William E. Acree, Jr., James S. Chickos

Enthalpy of sublimation

ΔsubH (kJ/mol) Temperature (K) Method Reference Comment
167.9494.AStephenson and Malanowski, 1987Based on data from 479. - 551. K.

Condensed phase thermochemistry data

Data compiled by: Hussein Y. Afeefy, Joel F. Liebman, and Stephen E. Stein

Quantity Value Units Method Reference Comment
Δfsolid70.9 ± 1.7kcal/molCcrBaroody and Carpenter, 1976
Δfsolid76.0 ± 4.0kcal/molCcbRouse, 1976
Quantity Value Units Method Reference Comment
Δcsolid-2250.9 ± 1.7kcal/molCcrBaroody and Carpenter, 1976
Δcsolid-2256.0 ± 1.7kcal/molCcbRouse, 1976

References

Stephenson and Malanowski, 1987
Stephenson, Richard M.; Malanowski, Stanislaw, Handbook of the Thermodynamics of Organic Compounds, 1987, https://doi.org/10.1007/978-94-009-3173-2 . [all data]