Benzaldehyde, 2,4,6-trimethyl-

Normal alkane RI, non-polar column, temperature ramp

View large format table.

Column type Active phase I Reference Comment
CapillaryHP-5 MS1323.Radulovic, Blagojevic, et al., 201030. m/0.25 mm/0.25 μm, Helium, 5. K/min, 290. C @ 10. min; Tstart: 70. C
CapillaryDB-11338.Pala-Paul, Brophy, et al., 200750. m/0.25 mm/0.25 μm, He, 4. K/min; Tstart: 95. C; Tend: 240. C
CapillaryDB-11338.Palá-Paúl, Pérez-Alonso, et al., 200550. m/0.25 mm/0.25 μm, N2, 4. K/min; Tstart: 95. C; Tend: 240. C
CapillaryDB-11329.Palá-Paúl, Velasco-Negueruela, et al., 200450. m/0.25 mm/0.25 μm, N2, 4. K/min; Tstart: 95. C; Tend: 240. C
CapillaryHP-11286.Boatright and Crum, 199730. m/0.25 mm/0.1 μm, He, 50. C @ 2. min, 5. K/min, 300. C @ 3. min

Normal alkane RI, non-polar column, custom temperature program

View large format table.

Column type Active phase I Reference Comment
CapillaryTR-5 MS1342.Kurashov, Mitrukova, et al., 201415. m/0.25 mm/0.25 μm, Helium; Program: 35 0C (3 min) 2 0C/min -> 60 0C (3 min) 2 0C/min -> 80 0C (3 min) 4 0C/min -> 120 0C (3 min) 5 0C/min -> 150 0C (3 min) 15 0C/min -> 240 0C (10 min)
CapillaryBP-51335.Eyres, Dufour, et al., 200525. m/0.32 mm/0.50 μm, Helium; Program: 60 0C 6 0C/min -> 210 0C 10 0C/min -> 290 0C (10 min)
CapillaryBP-51339.Eyres, Dufour, et al., 200525. m/0.32 mm/0.50 μm, Helium; Program: 60 0C 6 0C/min -> 210 0C 10 0C/min -> 290 0C (10 min)
CapillaryBP-51347.Eyres, Dufour, et al., 200525. m/0.32 mm/0.50 μm, Helium; Program: 60 0C 6 0C/min -> 210 0C 10 0C/min -> 290 0C (10 min)
CapillaryBP-51335.Eyres, Dufour, et al., 200525. m/0.32 mm/0.50 μm, Helium; Program: 60 0C 6 0C/min -> 210 0C 10 0C/min -> 290 0C (10 min)

Normal alkane RI, polar column, temperature ramp

View large format table.

Column type Active phase I Reference Comment
CapillaryDB-Wax1929.Pala-Paul, Brophy, et al., 200760. m/0.32 mm/0.25 μm, He, 4. K/min; Tstart: 70. C; Tend: 220. C
CapillaryDB-Wax1929.Palá-Paúl, Pérez-Alonso, et al., 200560. m/0.32 mm/0.25 μm, He, 3. K/min; Tstart: 35. C; Tend: 220. C

Phase change data

Data compiled by: Robert L. Brown and Stephen E. Stein

Quantity Value Units Method Reference Comment
Tboil510.2KN/AAldrich Chemical Company Inc., 1990
Tboil511.7KN/AWeast and Grasselli, 1989

Gas phase ion energetics data

Data compiled by: John E. Bartmess

Electron affinity determinations

EA (eV) Method Reference Comment
0.442 ± 0.043ECDWentworth and Ristau, 1969

References

Radulovic, Blagojevic, et al., 2010
Radulovic, N.; Blagojevic, P.; Palic, R., Comparative study of the leaf volatiles of Arctostaphylos uva-ursi (L.) Spreng. and Vaccinium vitis-idaea L. (Ericaceae), Molecules, 2010, 15, 9, 6168-6185, https://doi.org/10.3390/molecules15096168 . [all data]

Pala-Paul, Brophy, et al., 2007
Pala-Paul, J.; Brophy, J.J.; Perez-Alonso, M.J.; Usano, J.; Soria, S.C., Essential oil composition of the different parts of Eryngium corniculatum Lam. (Apiaceae) from Spain, J. Chromatogr. A, 2007, 1175, 2, 289-293, https://doi.org/10.1016/j.chroma.2007.10.061 . [all data]

Palá-Paúl, Pérez-Alonso, et al., 2005
Palá-Paúl, J.; Pérez-Alonso, M.; Velasco-Negueruela, A.; Vadaré, J.; Villa, A.M.; Sanz, J.; Brophy, J.J., Analysis of the essential oil composition from the different parts of Eryngium glaciale Boiss. from Spain, J. Chromatogr. A, 2005, 1094, 1-2, 179-182, https://doi.org/10.1016/j.chroma.2005.09.029 . [all data]

Palá-Paúl, Velasco-Negueruela, et al., 2004
Palá-Paúl, J.; Velasco-Negueruela, A.; Pérez-Alonso, M.J.; Maqueda, J.; Sanz, J., Volatile oil constituents from different parts of Cachrys trifida L., J. Essent. Oil Res., 2004, 16, 4, 347-349, https://doi.org/10.1080/10412905.2004.9698738 . [all data]

Boatright and Crum, 1997
Boatright, W.L.; Crum, A.D., Nonpolar-volatile lipids from soy protein isolates and hexane-defatted flakes, J. Amer. Oil Chem. Soc., 1997, 74, 4, 461-467, https://doi.org/10.1007/s11746-997-0107-z . [all data]

Kurashov, Mitrukova, et al., 2014
Kurashov, E.A.; Mitrukova, G.G.; Krylova, Yu.V., Variations in the component composition of essential oil of Ceratophyllum demersum (Ceratophyllaceae) during vegetation (in press), Plant Resources (Rastitel'nye Resursy), 2014, 1, 000-000. [all data]

Eyres, Dufour, et al., 2005
Eyres, G.; Dufour, J.-P.; Hallifax, G.; Sotheeswaran, S.; Marriott, P.J., Identification of character-impact odorants in coriander and wild coriander leaves using gas chromatography-olfactometry (GCO) and comprehensive two-dimensional gas chromatography-time-of-flight mass spectrometry (GC×GC-TOFMS), J. Sep. Sci., 2005, 28, 9-10, 1061-1074, https://doi.org/10.1002/jssc.200500012 . [all data]