1-Hexen-3-ol

Gas phase ion energetics data

Data compiled by: John E. Bartmess

De-protonation reactions

C6H11O- + Hydrogen cation = 1-Hexen-3-ol

By formula: C6H11O- + H+ = C6H12O

Quantity Value Units Method Reference Comment
Δr1546. ± 8.8kJ/molG+TSRozeboom, Kiplinger, et al., 1984gas phase
Quantity Value Units Method Reference Comment
Δr1518. ± 8.4kJ/molIMRERozeboom, Kiplinger, et al., 1984gas phase

Reaction thermochemistry data

Data compiled by: John E. Bartmess

Individual Reactions

C6H11O- + Hydrogen cation = 1-Hexen-3-ol

By formula: C6H11O- + H+ = C6H12O

Quantity Value Units Method Reference Comment
Δr369.4 ± 2.1kcal/molG+TSRozeboom, Kiplinger, et al., 1984gas phase
Quantity Value Units Method Reference Comment
Δr362.8 ± 2.0kcal/molIMRERozeboom, Kiplinger, et al., 1984gas phase

Kovats' RI, non-polar column, isothermal

View large format table.

Column type Active phase Temperature (C) I Reference Comment
PackedSE-30100.771.Pías and Gascó, 1975Ar, Chromosorb W AW DMCS HP (80-100 mesh); Column length: 1. m
PackedSE-30120.770.Pías and Gascó, 1975Ar, Chromosorb W AW DMCS HP (80-100 mesh); Column length: 1. m
PackedSE-30140.767.Pías and Gascó, 1975Ar, Chromosorb W AW DMCS HP (80-100 mesh); Column length: 1. m
PackedSqualane50.746.Mira and Sanchez, 1970Chromosorb G

Kovats' RI, non-polar column, temperature ramp

View large format table.

Column type Active phase I Reference Comment
CapillaryBP-1772.Raina, Srivastava, et al., 200225. m/0.55 mm/0.25 μm, N2, 5. K/min, 220. C @ 15. min; Tstart: 60. C
CapillaryDB-1756.Takeoka, Perrino, et al., 199660. m/0.25 mm/0.25 μm, 30. C @ 4. min, 2. K/min; Tend: 220. C
CapillaryDB-1769.Takeoka, Perrino, et al., 199660. m/0.25 mm/0.25 μm, 30. C @ 4. min, 2. K/min; Tend: 220. C

Van Den Dool and Kratz RI, non-polar column, temperature ramp

View large format table.

Column type Active phase I Reference Comment
CapillaryDB-5779.Methven L., Tsoukka M., et al., 200760. m/0.32 mm/1. μm, 40. C @ 2. min, 4. K/min, 260. C @ 10. min
CapillaryMethyl Silicone776.Sumathykutty, Rao, et al., 199950. m/0.25 mm/0.17 μm, N2, 2. K/min; Tstart: 80. C; Tend: 200. C

Van Den Dool and Kratz RI, polar column, temperature ramp

View large format table.

Column type Active phase I Reference Comment
CapillaryDB-Wax1225.Fröhlich, Duque, et al., 198930. m/0.25 mm/0.25 μm, He, 50. C @ 3. min, 4. K/min; Tend: 250. C
CapillaryDB-Wax1228.Fröhlich, Duque, et al., 198930. m/0.25 mm/0.25 μm, He, 50. C @ 3. min, 4. K/min; Tend: 250. C
CapillarySupelcowax-101254.Tanchotikul and Hsieh, 198960. m/0.25 mm/0.25 μm, 40. C @ 5. min, 2. K/min, 175. C @ 20. min
CapillarySupelcowax-101261.Tanchotikul and Hsieh, 198960. m/0.25 mm/0.25 μm, 40. C @ 5. min, 2. K/min, 175. C @ 20. min

Normal alkane RI, non-polar column, temperature ramp

View large format table.

Column type Active phase I Reference Comment
CapillaryRSL-200767.Jirovetz, Buchbauer, et al., 200330. m/0.32 mm/0.25 μm, H2, 40. C @ 5. min, 6. K/min, 280. C @ 5. min
CapillaryRSL-200771.Jirovetz, Ngassoum, et al., 200230. m/0.32 mm/0.25 μm, H2, 50. C @ 5. min, 6. K/min, 280. C @ 5. min
CapillaryOV-101764.Menon, Chacko, et al., 1999N2, 1. K/min, 200. C @ 20. min; Column length: 50. m; Column diameter: 0.2 mm; Tstart: 80. C

Normal alkane RI, non-polar column, custom temperature program

View large format table.

Column type Active phase I Reference Comment
CapillaryMethyl Silicone771.Kou, Zhang, et al., 2006Program: not specified
CapillaryMethyl Silicone771.Fu and Wang, 2004Program: not specified
CapillarySE-30770.Vinogradov, 2004Program: not specified

Normal alkane RI, polar column, temperature ramp

View large format table.

Column type Active phase I Reference Comment
CapillaryDB-Wax Etr1295.Ibarz, Ferreira, et al., 200660. m/0.25 mm/0.25 μm, He, 40. C @ 5. min, 2. K/min, 230. C @ 100. min
CapillaryDB-Wax1248.Horiuchi, Umano, et al., 199860. m/0.25 mm/1. μm, He, 3. K/min, 200. C @ 40. min; Tstart: 50. C

Normal alkane RI, polar column, custom temperature program

View large format table.

Column type Active phase I Reference Comment
CapillaryCarbowax 20M1225.Vinogradov, 2004Program: not specified

References

Rozeboom, Kiplinger, et al., 1984
Rozeboom, M.D.; Kiplinger, J.P.; Bartmess, J.E., The Anionic Oxy-Cope Rearrangement: Structural Effects in the Gas Phase and in Solution, J. Am. Chem. Soc., 1984, 106, 4, 1025, https://doi.org/10.1021/ja00316a035 . [all data]