2,6-Dichloropyrazine

Phase change data

Data compiled by: William E. Acree, Jr., James S. Chickos

Quantity Value Units Method Reference Comment
Δsub69.9 ± 2.0kJ/molCMorais, Miranda, et al., 2004

Normal alkane RI, non-polar column, temperature ramp

View large format table.

Column type Active phase I Reference Comment
CapillaryBPX-51017.Dickschat, Reichenbach, et al., 200525. m/0.22 mm/0.25 μm, He, 50. C @ 5. min, 5. K/min; Tend: 320. C

References

Morais, Miranda, et al., 2004
Morais, Victor M.F.; Miranda, Margarida S.; Matos, M. Agostinha R., Thermochemical study of chloropyrazines and chloroquinoxalines, The Journal of Chemical Thermodynamics, 2004, 36, 5, 377-383, https://doi.org/10.1016/j.jct.2004.01.005 . [all data]