Propanoic acid, 2,2,3-trichloro-, methyl ester

Kovats' RI, non-polar column, isothermal

View large format table.

Column type Active phase Temperature (C) I Reference Comment
CapillaryOV-101120.1031.Evans, Haken, et al., 1986
CapillaryOV-101100.1030.Haken and Korhonen, 1984N2; Column length: 25. m; Column diameter: 0.3 mm
CapillaryOV-101120.1031.Haken and Korhonen, 1984N2; Column length: 25. m; Column diameter: 0.3 mm
CapillaryOV-10180.1028.Haken and Korhonen, 1984N2; Column length: 25. m; Column diameter: 0.3 mm

References

Evans, Haken, et al., 1986
Evans, M.B.; Haken, J.K.; Tóth, T., Solute characterization in gas chromatography by an extension of Kováts retention index system. Dispersion and selectivity indices, J. Chromatogr., 1986, 351, 155-164, https://doi.org/10.1016/S0021-9673(01)83484-1 . [all data]

Haken and Korhonen, 1984
Haken, J.K.; Korhonen, I.O.O., Gas chromatography of homologous esters. XXIV. Studies of chlorinated methyl propanoates and butanoates on a non-polar capillary column, J. Chromatogr., 1984, 284, 474-477, https://doi.org/10.1016/S0021-9673(01)87849-3 . [all data]