7,14-Methano-4H,6H-dipyrido[1,2-a:1',2'-e][1,5]diazocine-4,13(14H)-dione, decahydro-, [7S-(7α,7aβ,14α,14aα)]-

Normal alkane RI, non-polar column, temperature ramp

View large format table.

Column type Active phase I Reference Comment
CapillaryDB-52373.Przybylak, Ciesiolka, et al., 2005He, 180. C @ 2. min, 5. K/min, 300. C @ 10. min; Column length: 30. m; Column diameter: 0.25 mm
CapillaryDB-12364.Torres, Quintos, et al., 200230. m/0.25 mm/0.25 μm, He, 120. C @ 3. min, 10. K/min, 260. C @ 10. min
CapillaryDB-12345.van Wyk, Greinwald, et al., 19956. K/min; Column length: 30. m; Column diameter: 0.32 mm; Tstart: 150. C; Tend: 300. C
CapillaryDB-12350.Wink and Witte, 199130. m/0.32 mm/1.0 μm, Helium, 150. C @ 1. min, 10. K/min; Tend: 300. C
CapillarySE-302300.Wink, Witte, et al., 1983He, 6. K/min; Column length: 15. m; Column diameter: 0.26 mm; Tstart: 150. C; Tend: 270. C
CapillarySE-302300.Wink, Witte, et al., 1981He, 6. K/min; Column length: 15. m; Column diameter: 0.26 mm; Tstart: 150. C; Tend: 270. C

Normal alkane RI, non-polar column, custom temperature program

View large format table.

Column type Active phase I Reference Comment
CapillaryDB-5 MS2356.Cook, Lee, et al., 2009Column length: 30. m; Column diameter: 0.25 mm; Program: 100 0C (1 min) 40 0C/min -> 200 0C 5 0C/min -> 275 0C (15 min)
CapillaryDB-12340.El-Shazly, Ateya, et al., 2001Helium; Column length: 15. m; Column diameter: 0.317 mm; Program: 150 0C (2 min) 15 0C/min -> 250 0C 25 0C/min -> 300 0C (5 min)
CapillaryDB-12350.Wink, Meissner, et al., 1995Column length: 30. m; Column diameter: 0.3 mm; Program: not specified
CapillarySE-542300.Detzel and Wink, 199315. m/0.25 mm/0.16 μm, Helium; Program: 150 0C (2 min) 15 0C/min -> 250 0C 25 0C/min -> 200 0C (10 min)

References

Przybylak, Ciesiolka, et al., 2005
Przybylak, J.K.; Ciesiolka, D.; Wysocka, W.; García-López, P.M.; Ruiz-López, M.A.; Wysocki, W.; Gulewicz, K., Alkaloid profiles of Mexican wild lupin and an effect of alkaloid preparation from Lupinus exaltatus seeds on growth and yield of paprika (Capsicum annuum L.), Ind. Crops Prod., 2005, 21, 1, 1-7, https://doi.org/10.1016/j.indcrop.2003.12.001 . [all data]

Torres, Quintos, et al., 2002
Torres, K.B.; Quintos, N.R.; Necha, L.L.B.; Wink, M., Alkaloid profile of leaves and seeds of Lupinus hintonii C.P. Smith, Z. Naturforsch., 2002, 57c, 243-247. [all data]

van Wyk, Greinwald, et al., 1995
van Wyk, B.-E.; Greinwald, R.; Witte, L., Alkaloid variation in the Lupinus pusillus group (Fabaceae: tribe Genisteae), Biochem. Syst. Ecol., 1995, 23, 5, 533-537, https://doi.org/10.1016/0305-1978(95)00036-T . [all data]

Wink and Witte, 1991
Wink, M.; Witte, L., Storage of quinolizidine alkaloids in Macrosiphum albifrons and Aphis genistae (Homoptera: Aphididae), Entomol. Gener., 1991, 15, 4, 237-254, https://doi.org/10.1127/entom.gen/15/1991/237 . [all data]

Wink, Witte, et al., 1983
Wink, M.; Witte, L.; Hartmann, T.; Theuring, C.; Volz. V., Accumulation of quinolizidine alkaloids in plants and cell suspension cultures: genera lupinus, cytisus, baptisia, genista, laburnum, and sophora, Planta Medica, 1983, 48, 4, 253-257, https://doi.org/10.1055/s-2007-969928 . [all data]

Wink, Witte, et al., 1981
Wink, M.; Witte, L.; Hartmann. T., Quinolizidine Alkaloid Composition of Plants and of Photomixotrophis Cell Suspension Cultures of Sarothamnus scoparius and Orobanche rapum-genistae, Planta Medica, 1981, 43, 12, 342-352, https://doi.org/10.1055/s-2007-971522 . [all data]

Cook, Lee, et al., 2009
Cook, D.; Lee, S.T.; GArdner, D.R.; Pfister, J.A.; Welch, K.D.; Green, B.T.; Davis, T.Z.; Panter, K.E., The alkaloids profiles of lupinus sulphureus, J. Agric. Food Chem., 2009, 57, 4, 1646-1653, https://doi.org/10.1021/jf803468q . [all data]

El-Shazly, Ateya, et al., 2001
El-Shazly, A.; Ateya, A.-M.M.; Wink, M., Quinolizidine alkaloid profiles of lupunus varius orientalis. L. albus albus, L. hartwegii, and L. densiflorus, Z. Naturforsch., 2001, 56c, 21-30. [all data]

Wink, Meissner, et al., 1995
Wink, M.; Meissner, C.; Witte, L., Patterns of quinolizidine alkaloids in 56 species of the genus Lupinus, Phytochemistry, 1995, 38, 1, 139-153, https://doi.org/10.1016/0031-9422(95)91890-D . [all data]

Detzel and Wink, 1993
Detzel, A.; Wink, M., Attraction. deterrence or intoxication of bees (Apis mellifera) by plant allelochemicals, Chemoecology, 1993, 4, 1, 8-18, https://doi.org/10.1007/BF01245891 . [all data]