Benzopinacol

Gas phase ion energetics data

Data compiled by: Sharon G. Lias and Joel F. Liebman

Ionization energy determinations

IE (eV) Method Reference Comment
8.42 ± 0.02PEPenn, Lin, et al., 1991Vertical value

References

Penn, Lin, et al., 1991
Penn, J.H.; Lin, Z.; Deng, D-L., Tetraarylethanediols: surprisingly low energy requirements for electron transfer in solution and in the gas phase, J. Am. Chem. Soc., 1991, 113, 1001. [all data]