9H-Fluorene, 9,9-dimethyl-

Gas phase ion energetics data

Data compiled by: Sharon G. Lias, Rhoda D. Levin, and Sherif A. Kafafi

Ionization energy determinations

IE (eV) Method Reference Comment
7.8PESchweig, Weidner, et al., 1973Vertical value

References

Schweig, Weidner, et al., 1973
Schweig, A.; Weidner, U.; Hellwinkel, D.; Krapp, W., Spiroconjugation, Angew. Chem. Int. Ed. Engl., 1973, 12, 310. [all data]