5-Methylbenzo[b]naphtho[2,1-d]thiophene

Lee's RI, non-polar column, temperature ramp

View large format table.

Column type Active phase I Reference Comment
CapillaryRxi-5 MS408.94Zeigler, Schantz, et al., 201230. m/0.25 mm/0.25 μm, Helium, 60. C @ 1. min, 5. K/min, 340. C @ 0. min
CapillarySE-52410.58Vassilaros, Kong, et al., 198220. m/0.30 mm/0.25 μm, H2, 40. C @ 2. min, 4. K/min; Tend: 265. C

Lee's RI, non-polar column, custom temperature program

View large format table.

Column type Active phase I Reference Comment
CapillaryDB-5409.35Mössner, de Alda, et al., 199960. m/0.25 mm/0.25 μm, He; Program: 60C (1 min) => 45 C/min => 150C (2 min) => 2 C/min => 300 C (25 min)

References

Zeigler, Schantz, et al., 2012
Zeigler, C.; Schantz, M.; Wise, S.; Robbat, A., Mass spectra and retention indices for polycyclic aromatic sulfur heterocycles and some alkylated analogs, Polycyclic Aromatic Compounds, 2012, 32, 2, 154-176, https://doi.org/10.1080/10406638.2011.651679 . [all data]

Vassilaros, Kong, et al., 1982
Vassilaros, D.L.; Kong, R.C.; Later, D.W.; Lee, M.L., Linear retention index system for polycyclic aromatic compounds. Critical evaluation and additional indices, J. Chromatogr., 1982, 252, 1-20, https://doi.org/10.1016/S0021-9673(01)88394-1 . [all data]

Mössner, de Alda, et al., 1999
Mössner, S.G.; de Alda, M.J.L.; Sander, L.C.; Lee, M.L.; Wise, S.A., Gas chromatographic retention behavior of polycyclic aromatic sulfur heterocyclic compounds, (dibenzothiophene, naphtho[b]thiophenes, benzo[b]naphthothiophenes and alkyl-substituted derivatives) on stationary phases of different selectivity, J. Chromatogr. A, 1999, 841, 2, 207-228, https://doi.org/10.1016/S0021-9673(99)00363-5 . [all data]