Benzenemethanol, 3-fluoro-

Gas phase ion energetics data

Data compiled by: John E. Bartmess

De-protonation reactions

C7H6FO- + Hydrogen cation = Benzenemethanol, 3-fluoro-

By formula: C7H6FO- + H+ = C7H7FO

Quantity Value Units Method Reference Comment
Δr1526. ± 8.8kJ/molG+TSMustanir, Than, et al., 2005gas phase
Quantity Value Units Method Reference Comment
Δr1499. ± 8.4kJ/molIMREMustanir, Than, et al., 2005gas phase

References

Mustanir, Than, et al., 2005
Mustanir; Than, S.; Mishima, M., Substituent effects on the gas phase acidity of phenylacetylenes and benzyl alcohols, Bull. Chem. Soc. Japan, 2005, 78, 1, 147-153, https://doi.org/10.1246/bcsj.78.147 . [all data]