Benzenamine, 4-fluoro-2-methyl-

Phase change data

Data compiled as indicated in comments:
BS - Robert L. Brown and Stephen E. Stein
AC - William E. Acree, Jr., James S. Chickos

Quantity Value Units Method Reference Comment
Δvap59.8 ± 0.8kJ/molCRibeiro da Silva, Ferreira, et al., 2007AC

Reduced pressure boiling point

Tboil (K) Pressure (bar) Reference Comment
364.20.021Aldrich Chemical Company Inc., 1990BS
363. - 365.0.021PCR Inc., 1990BS
367.20.021Weast and Grasselli, 1989BS

References

Ribeiro da Silva, Ferreira, et al., 2007
Ribeiro da Silva, Manuel A.V.; Ferreira, Ana I.M.C.L.; Gomes, José R.B., Experimental and Computational Study of the Thermochemistry of the Fluoromethylaniline Isomers, J. Phys. Chem. B, 2007, 111, 23, 6444-6451, https://doi.org/10.1021/jp071232o . [all data]

Aldrich Chemical Company Inc., 1990
Aldrich Chemical Company Inc., Catalog Handbook of Fine Chemicals, Aldrich Chemical Company, Inc., Milwaukee WI, 1990, 1. [all data]

PCR Inc., 1990
PCR Inc., Research Chemicals Catalog 1990-1991, PCR Inc., Gainesville, FL, 1990, 1. [all data]

Weast and Grasselli, 1989
CRC Handbook of Data on Organic Compounds, 2nd Editon, Weast,R.C and Grasselli, J.G., ed(s)., CRC Press, Inc., Boca Raton, FL, 1989, 1. [all data]