Naphthalene, 1,2-dihydro-1,5,8-trimethyl-

Van Den Dool and Kratz RI, non-polar column, temperature ramp

View large format table.

Column type Active phase I Reference Comment
CapillaryDB-Petro1376.2Pang T., Zhu S., et al., 200750. m/0.2 mm/0.5 μm, 2. K/min; Tstart: 50. C; Tend: 270. C
CapillaryDB-Petro1377.6Pang T., Zhu S., et al., 200750. m/0.2 mm/0.5 μm, 2. K/min; Tstart: 50. C; Tend: 270. C

Normal alkane RI, non-polar column, temperature ramp

View large format table.

Column type Active phase I Reference Comment
CapillaryHP-51354.Yayli, Gülec, et al., 200630. m/0.32 mm/0.25 μm, He, 60. C @ 2. min, 5. K/min, 260. C @ 14. min

References

Pang T., Zhu S., et al., 2007
Pang T.; Zhu S.; Lu X.; Xu G., Identification of unknown compounds on the basis of retention index data in comprehensive two-dimensional gas chromatography, J. Sep. Sci., 2007, 30, 6, 868-874, https://doi.org/10.1002/jssc.200600471 . [all data]

Yayli, Gülec, et al., 2006
Yayli, N.; Gülec, C.; Ücüncü, O.; Yasar, A.; Ülker, S.; Coskuncelebi, K.; Terzioglu, S., Composition and Antimicrobial Activities of Volatile Components of Minuartia meyeri, Turk. J. Chem., 2006, 30, 71-76. [all data]