2-((2-[(2-Hydroxyethyl)amino]ethyl)amino)ethanol

Phase change data

Data compiled as indicated in comments:
TRC - Thermodynamics Research Center, NIST Boulder Laboratories, Chris Muzny director
AC - William E. Acree, Jr., James S. Chickos

Quantity Value Units Method Reference Comment
Ttriple373.2KN/ASteele, Chirico, et al., 1997Uncertainty assigned by TRC = 1. K; TRC
Ttriple373.2KN/ASteele, Chirico, et al., 1997, 2Uncertainty assigned by TRC = 0.5 K; TRC
Quantity Value Units Method Reference Comment
Δvap106.4 ± 6.4kJ/molEB,IPSteele, Chirico, et al., 1997, 3Based on data from 399. - 500. K. See also Steele, Chirico, et al., 1997, 4.; AC

Enthalpy of vaporization

ΔvapH (kJ/mol) Temperature (K) Method Reference Comment
91.2 ± 0.2400.EB,IPSteele, Chirico, et al., 1997, 3Based on data from 399. - 500. K. See also Steele, Chirico, et al., 1997, 4.; AC
87.7 ± 0.2440.EB,IPSteele, Chirico, et al., 1997, 3Based on data from 399. - 500. K. See also Steele, Chirico, et al., 1997, 4.; AC
84.8 ± 0.2480.EB,IPSteele, Chirico, et al., 1997, 3Based on data from 399. - 500. K. See also Steele, Chirico, et al., 1997, 4.; AC

Enthalpy of sublimation

ΔsubH (kJ/mol) Temperature (K) Method Reference Comment
142.7373.BSteele, Chirico, et al., 1997, 4AC

Enthalpy of fusion

ΔfusH (kJ/mol) Temperature (K) Reference Comment
49.7373.2Steele, Chirico, et al., 1997, 4AC

In addition to the Thermodynamics Research Center (TRC) data available from this site, much more physical and chemical property data is available from the following TRC products:

References

Steele, Chirico, et al., 1997
Steele, W.V.; Chirico, R.D.; Knipmeyer, S.E.; Nguyen, A., Vapor Pressure, Heat Capacity, and Density along the Saturated Line, Measurements for Dimethyl Isophthalate, Dimethyl Carbonate, 1,3,5-Trimethyl benzene, Pentafluorophenol, 4-tert-Butylcatechol, .alp, J. Chem. Eng. Data, 1997, 42, 1008-20. [all data]

Steele, Chirico, et al., 1997, 2
Steele, W.V.; Chirico, R.D.; Knipmeyer, S.E.; Nguyen, A.; Smith, N.K., Thermocynamic Properties and Ideal-Gas Enthalpies of Formation for Carbonate, Piperazine, Hexachloroprop-1-ene, Tetrakis(dimethylamino) ethylene, N,N'-Bis(2-hydroxyethyl)ethylenediamine, and 1,2,4-Tr, J. Chem. Eng. Data, 1997, 42, 1037-52. [all data]

Steele, Chirico, et al., 1997, 3
Steele, W.V.; Chirico, R.D.; Knipmeyer, S.E.; Nguyen, A., Vapor Pressure, Heat Capacity, and Density along the Saturation Line, Measurements for Dimethyl Isophthalate, Dimethyl Carbonate, 1,3,5-Triethylbenzene, Pentafluorophenol, 4- tert -Butylcatechol, α-Methylstyrene, and N , N '-Bis(2-hydroxyethyl)ethylenediamine, J. Chem. Eng. Data, 1997, 42, 6, 1008-1020, https://doi.org/10.1021/je970102d . [all data]

Steele, Chirico, et al., 1997, 4
Steele, W.V.; Chirico, R.D.; Knipmeyer, S.E.; Nguyen, A.; Smith, N.K., Thermodynamic Properties and Ideal-Gas Enthalpies of Formation for Dicyclohexyl Sulfide, Diethylenetriamine, Di- n -octyl Sulfide, Dimethyl Carbonate, Piperazine, Hexachloroprop-1-ene, Tetrakis(dimethylamino)ethylene, N , N '-Bis-(2-hydroxyethyl)ethylenediamine, and 1,2,4-Triazolo[1,5- a ]pyrimidine, J. Chem. Eng. Data, 1997, 42, 6, 1037-1052, https://doi.org/10.1021/je9700986 . [all data]