3-Methyl-2-phenylbutane-2-ol

Condensed phase thermochemistry data

Data compiled by: Hussein Y. Afeefy, Joel F. Liebman, and Stephen E. Stein

Quantity Value Units Method Reference Comment
Δfliquid-278.7 ± 3.1kJ/molCcbKozina, Pimenova, et al., 1985
Quantity Value Units Method Reference Comment
Δcliquid-6336.5 ± 2.7kJ/molCcbKozina, Pimenova, et al., 1985Corresponding Δfliquid = -278.8 kJ/mol (simple calculation by NIST; no Washburn corrections)

References

Kozina, Pimenova, et al., 1985
Kozina, M.P.; Pimenova, S.M.; Lukyanova, V.A.; Surmina, L.S., Enthalpies of combustion and formation of 2-phenylbicyclo[1,1,1]pentane-2-ol and 3-methyl-2-phenyl-butane-2-ol, Dokl. Phys. Chem. (Engl. Transl.), 1985, 283, 713-715. [all data]