2,2'-Methylenedithiophene

Gas phase ion energetics data

Data compiled by: Henry M. Rosenstock, Keith Draxl, Bruce W. Steiner, and John T. Herron

Ionization energy determinations

IE (eV) Method Reference
8.84CTSKraak and Wynberg, 1968
9.05CTSKraak and Wynberg, 1968

References

Kraak and Wynberg, 1968
Kraak, A.; Wynberg, H., Charge-transfer interaction of dithienyls and cyclopentadithiophenes with 1,3,5-trinitrobenzene (TNB), Tetrahedron, 1968, 24, 3881. [all data]