1-Hexyn-3-ol, 3-methyl-

Phase change data

Data compiled by: Thermodynamics Research Center, NIST Boulder Laboratories, Chris Muzny director

Quantity Value Units Method Reference Comment
Tboil409.65KN/AShikheev, 1946Uncertainty assigned by TRC = 3. K

In addition to the Thermodynamics Research Center (TRC) data available from this site, much more physical and chemical property data is available from the following TRC products:

References

Shikheev, 1946
Shikheev, I.A., Methylpropylethynyl- and Methylpropylvinylcarbinols and Hydrocarbons Obtained from Them, Zh. Obshch. Khim., 1946, 16, 657. [all data]