1,1,1,2,3,3-Hexafluoropropane

Phase change data

Data compiled as indicated in comments:
TRC - Thermodynamics Research Center, NIST Boulder Laboratories, Chris Muzny director
BS - Robert L. Brown and Stephen E. Stein

Quantity Value Units Method Reference Comment
Tboil279.7KN/AHwang, DesMarteau, et al., 1992Uncertainty assigned by TRC = 0.5 K; TRC
Tboil279.KN/APCR Inc., 1990BS
Quantity Value Units Method Reference Comment
Tc412.370KN/AAoyama, Kishizawa, et al., 1996Uncertainty assigned by TRC = 0.03 K; For ITS-90 scale, includes review of and comparison with previous literture; TRC
Quantity Value Units Method Reference Comment
ρc3.74mol/lN/AAoyama, Kishizawa, et al., 1996Uncertainty assigned by TRC = 0.01 mol/l; at critical opalesence, includes review of and comparison with previous literature; TRC

In addition to the Thermodynamics Research Center (TRC) data available from this site, much more physical and chemical property data is available from the following TRC products:

References

Hwang, DesMarteau, et al., 1992
Hwang, S.H.; DesMarteau, D.D.; Beyerlein, A.L.; Smith, N.D.; Joyner, P., The heat capacity of fluorinated propane and butane derivatives by differential scanning calorimetry, J. Therm. Anal., 1992, 38, 2515-28. [all data]

PCR Inc., 1990
PCR Inc., Research Chemicals Catalog 1990-1991, PCR Inc., Gainesville, FL, 1990, 1. [all data]

Aoyama, Kishizawa, et al., 1996
Aoyama, H.; Kishizawa, G.; Sato, H.; Watanabe, K., Vapor-Liquid Coexistence Curves in the Critical Region and the Critical Temperatures and Densities of 1,1,1,2-Tetrafluoroethane (R-134a), 1,1,1- Trifluoroethane (R-143a), and 1,1,1,2,3,3- Hexafluorop, J. Chem. Eng. Data, 1996, 41, 1046-1051. [all data]