2H-1-Benzothiopyran, octahydro-2-methyl-

Gas phase ion energetics data

Data compiled by: Sharon G. Lias, John E. Bartmess, Joel F. Liebman, John L. Holmes, Rhoda D. Levin, and W. Gary Mallard

Ionization energy determinations

IE (eV) Method Reference
7.76 ± 0.01EIMikaya, Trusova, et al., 1982

References

Mikaya, Trusova, et al., 1982
Mikaya, A.I.; Trusova, E.A.; Zaikin, V.G.; Karaulova, E.N.; Petrova, L.M., Ionization energy and appearance energy in organic chemistry. Communication 5. Energy differences of stereoisomers of 2-methyl-1-thiadecalin, Bull. Acad. Sci. USSR, Div. Chem. Sci., 1982, 1479. [all data]