Benzene, 1,1'-(1,1,2,2-tetrafluoro-1,2-ethanediyl)bis-

Phase change data

Data compiled as indicated in comments:
ALS - Hussein Y. Afeefy, Joel F. Liebman, and Stephen E. Stein
AC - William E. Acree, Jr., James S. Chickos

Quantity Value Units Method Reference Comment
Δsub101.8 ± 1.9kJ/molVSchaffer, Verevkin, et al., 1997Hfusion=28.83 kJ/mol; ALS
Δsub101.8kJ/molN/ASchaffer, Verevkin, et al., 1997AC

Enthalpy of fusion

ΔfusH (kJ/mol) Temperature (K) Reference Comment
28.83399.2Schaffer, Verevkin, et al., 1997AC

Gas phase thermochemistry data

Data compiled by: Hussein Y. Afeefy, Joel F. Liebman, and Stephen E. Stein

Quantity Value Units Method Reference Comment
Δfgas-164.7 ± 0.67kcal/molCcrSchaffer, Verevkin, et al., 1997Hfusion=28.83 kJ/mol

References

Schaffer, Verevkin, et al., 1997
Schaffer, F.; Verevkin, S.P.; Rieger, H.J.; Beckhaus, H.D.; Ruchardt, C., Enthalpies of formation of a series of fluorinated hydrocarbons and strain-free group increments to assess polar and anomeric stabilization and strain, Liebigs Ann., 1997, 1333-1344. [all data]