1-Cycloheptene-1-carboxylic acid, 6-oxo-, methyl ester

Reaction thermochemistry data

Data compiled by: Hussein Y. Afeefy, Joel F. Liebman, and Stephen E. Stein

Individual Reactions

3-(Methoxycarbonyl)-2-cycloheptenone = 1-Cycloheptene-1-carboxylic acid, 6-oxo-, methyl ester

By formula: C9H12O3 = C9H12O3

Quantity Value Units Method Reference Comment
Δr15.kJ/molEqkMease and Hirsch, 1984liquid phase; solvent: Toluene; GLC

References

Mease and Hirsch, 1984
Mease, R.C.; Hirsch, J.A., Medium-ring systems. 5. Synthesis and base-catalyzed isomerizations of medium-ring cycloalkenones with electron-withdrawing substituents, J. Org. Chem., 1984, 49, 2925-2937. [all data]