CHCH3

Ion clustering data

Data compiled by: Robert C. Dunbar

Clustering reactions

Chromium ion (1+) + CHCH3 = (Chromium ion (1+) • CHCH3)

By formula: Cr+ + C2H4 = (Cr+ • C2H4)

Quantity Value Units Method Reference Comment
Δr218. ± 13.kJ/molCIDTFisher and Armentrout, 1992

References

Fisher and Armentrout, 1992
Fisher, E.R.; Armentrout, P.B., Activation of Alkanes by Cr+: Unique Reactivity of Ground-State Cr+(6S) and Thermochemistry of Neutral and Ionic Chromium-Carbon Bonds, J. Am. Chem. Soc., 1992, 114, 6, 2039, https://doi.org/10.1021/ja00032a017 . [all data]