Propane, 1,2-dichloro-2-fluoro-

Phase change data

Data compiled by: Thermodynamics Research Center, NIST Boulder Laboratories, Chris Muzny director

Quantity Value Units Method Reference Comment
Tboil359.75KN/AHenne and Plueddeman, 1943Uncertainty assigned by TRC = 0.4 K
Quantity Value Units Method Reference Comment
Tfus181.45KN/AHenne and Plueddeman, 1943Uncertainty assigned by TRC = 0.5 K

In addition to the Thermodynamics Research Center (TRC) data available from this site, much more physical and chemical property data is available from the following TRC products:

References

Henne and Plueddeman, 1943
Henne, A.L.; Plueddeman, E.P., The Addition of Hydrogen Fluoride to Halo-olefins, J. Am. Chem. Soc., 1943, 65, 1271. [all data]