n-Pentylmalononitrile

Phase change data

Data compiled as indicated in comments:
ALS - Hussein Y. Afeefy, Joel F. Liebman, and Stephen E. Stein
DRB - Donald R. Burgess, Jr.
AC - William E. Acree, Jr., James S. Chickos

Quantity Value Units Method Reference Comment
Δvap67.0 ± 0.4kJ/molVBeckhaus, Dogan, et al., 1990ALS
Δvap67.1kJ/molN/ABeckhaus, Dogan, et al., 1990DRB

Enthalpy of vaporization

ΔvapH (kJ/mol) Temperature (K) Method Reference Comment
66.9 ± 0.4298. - 328.GSBeckhaus, Dogan, et al., 1990AC

Gas phase thermochemistry data

Data compiled by: Hussein Y. Afeefy, Joel F. Liebman, and Stephen E. Stein

Quantity Value Units Method Reference Comment
Δfgas32.45 ± 0.15kcal/molCcbBeckhaus, Dogan, et al., 1990

Condensed phase thermochemistry data

Data compiled by: Hussein Y. Afeefy, Joel F. Liebman, and Stephen E. Stein

Quantity Value Units Method Reference Comment
Δfliquid16.43 ± 0.12kcal/molCcbBeckhaus, Dogan, et al., 1990
Quantity Value Units Method Reference Comment
Δcliquid-1178.72 ± 0.12kcal/molCcbBeckhaus, Dogan, et al., 1990

References

Beckhaus, Dogan, et al., 1990
Beckhaus, H.D.; Dogan, B.; Pakusch, J.; Verevkin, S.; Ruechardt, C., Geminal substituent effects. 4. The dependence of the inverse anomeric effect of geminal cyano groups on the structure, Chem. Ber., 1990, 123, 2153-2159. [all data]