2-Pentene, 2-methoxy-, (E)-

Reaction thermochemistry data

Data compiled by: Hussein Y. Afeefy, Joel F. Liebman, and Stephen E. Stein

Individual Reactions

1-Pentene, 2-methoxy- = 2-Pentene, 2-methoxy-, (E)-

By formula: C6H12O = C6H12O

Quantity Value Units Method Reference Comment
Δr0.78 ± 0.39kJ/molEqkTaskinen, 1974liquid phase; solvent: Cyclohexane; GLC

References

Taskinen, 1974
Taskinen, E., Thermodynamics of vinyl ethers. III. On the relative stabilities of 2-methoxy-1-butene, (E)-2-methoxy-2-butene, and (Z)-2-methoxy-2-butene, and related isomeric compounds, J. Chem. Thermodyn., 1974, 6, 345-353. [all data]