Tetrakil(trimethylsilyl)silane

Gas phase ion energetics data

Data compiled as indicated in comments:
LLK - Sharon G. Lias, Rhoda D. Levin, and Sherif A. Kafafi
RDSH - Henry M. Rosenstock, Keith Draxl, Bruce W. Steiner, and John T. Herron

Ionization energy determinations

IE (eV) Method Reference Comment
7.41 ± 0.01EIPitt, Bursey, et al., 1970RDSH
8.24PEBock and Ensslin, 1971Vertical value; LLK

References

Pitt, Bursey, et al., 1970
Pitt, C.G.; Bursey, M.M.; Rogerson, P.F., Catenates of the group IV elements. Correlation of σ electron energies, J. Am. Chem. Soc., 1970, 92, 519. [all data]

Bock and Ensslin, 1971
Bock, H.; Ensslin, W., Bond-bond interaction in polysilanes, Angew. Chem. Int. Ed. Engl., 1971, 10, 404. [all data]