Cyclohexasilane, dodecamethyl-

Gas phase ion energetics data

Data compiled as indicated in comments:
LLK - Sharon G. Lias, Rhoda D. Levin, and Sherif A. Kafafi
RDSH - Henry M. Rosenstock, Keith Draxl, Bruce W. Steiner, and John T. Herron

Ionization energy determinations

IE (eV) Method Reference Comment
7.29 ± 0.01EIPitt, Bursey, et al., 1970RDSH
7.79PEBock and Ensslin, 1971Vertical value; LLK

Phase change data

Data compiled as indicated in comments:
TRC - Thermodynamics Research Center, NIST Boulder Laboratories, Chris Muzny director
AC - William E. Acree, Jr., James S. Chickos

Quantity Value Units Method Reference Comment
Tfus528.8KN/ACao, Wesson, et al., 1986Crystal phase 1 phase; Uncertainty assigned by TRC = 0.1 K; TRC

Enthalpy of fusion

ΔfusH (kcal/mol) Temperature (K) Reference Comment
1.0528.8Cao, Wesson, et al., 1986, 2AC

In addition to the Thermodynamics Research Center (TRC) data available from this site, much more physical and chemical property data is available from the following TRC products:

References

Pitt, Bursey, et al., 1970
Pitt, C.G.; Bursey, M.M.; Rogerson, P.F., Catenates of the group IV elements. Correlation of σ electron energies, J. Am. Chem. Soc., 1970, 92, 519. [all data]

Bock and Ensslin, 1971
Bock, H.; Ensslin, W., Bond-bond interaction in polysilanes, Angew. Chem. Int. Ed. Engl., 1971, 10, 404. [all data]