N-Phenylpiperidine

Phase change data

Data compiled as indicated in comments:
BS - Robert L. Brown and Stephen E. Stein
TRC - Thermodynamics Research Center, NIST Boulder Laboratories, Chris Muzny director
AC - William E. Acree, Jr., James S. Chickos

Quantity Value Units Method Reference Comment
Tboil531.2KN/AWeast and Grasselli, 1989BS
Tboil530.65KN/AAroney and Le Fevre, 1960Uncertainty assigned by TRC = 4. K; TRC
Quantity Value Units Method Reference Comment
Δvap64.3 ± 0.4kJ/molGSVerevkin, 1998Based on data from 284. - 323. K.; AC

Enthalpy of vaporization

ΔvapH (kJ/mol) Temperature (K) Method Reference Comment
64.0 ± 0.4303.GSVerevkin, 1998Based on data from 284. - 323. K.; AC

In addition to the Thermodynamics Research Center (TRC) data available from this site, much more physical and chemical property data is available from the following TRC products:

References

Weast and Grasselli, 1989
CRC Handbook of Data on Organic Compounds, 2nd Editon, Weast,R.C and Grasselli, J.G., ed(s)., CRC Press, Inc., Boca Raton, FL, 1989, 1. [all data]

Aroney and Le Fevre, 1960
Aroney, M.; Le Fevre, R.J.W., Molecular polarizability. The conformation of various n-substituted anilines, piperidines, and piperazines, J. Chem. Soc., 1960, 1960, 2161. [all data]

Verevkin, 1998
Verevkin, Sergey P., Structural Chemistry, 1998, 9, 2, 113-119, https://doi.org/10.1023/A:1022459803871 . [all data]