1,4-Diiodonorbornane

Gas phase ion energetics data

Data compiled by: Sharon G. Lias, John E. Bartmess, Joel F. Liebman, John L. Holmes, Rhoda D. Levin, and W. Gary Mallard

Ionization energy determinations

IE (eV) Method Reference Comment
8.9PEHonegger, Heilbronner, et al., 1985
9.11 ± 0.02PEHonegger, Heilbronner, et al., 1985Vertical value

References

Honegger, Heilbronner, et al., 1985
Honegger, E.; Heilbronner, E.; Hess, N.; Martin, H.-D., Photoelectron spectra of symmetrical 1,4-dihalonorbornanes, Chem. Ber., 1985, 118, 2927. [all data]