5-Methyl-2,4-diisopropylphenol

Normal alkane RI, non-polar column, temperature ramp

Data compiled by: NIST Mass Spectrometry Data Center, William E. Wallace, director

Column type Capillary
Active phase OV-101
Column length (m) 50.
Carrier gas
Substrate
Column diameter (mm) 0.32
Phase thickness (μm)
Tstart (C) 50.
Tend (C) 225.
Heat rate (K/min) 4.
Initial hold (min) 0.1
Final hold (min) 30.
I 1475.
ReferenceStern, Flath, et al., 1985
Comment MSDC-RI

References

Stern, Flath, et al., 1985
Stern, D.J.; Flath, R.A.; Mon, T.R.; Teranishi, R.; Lundin, R.E.; Benson, M.E., Crude oleic acid volatiles, J. Agric. Food Chem., 1985, 33, 2, 180-184, https://doi.org/10.1021/jf00062a005 . [all data]