Alprenolol, N,O-di(trifluoroacetyl)-

Kovats' RI, non-polar column, isothermal

View large format table.

Column type Active phase Temperature (C) I Reference Comment
PackedOV-1210.1861.Marko, 1988N2, Chromosorb W AW DMCS; Column length: 1. m

References

Marko, 1988
Marko, V., Retention indices of some β-adrenolytics and their perfluoroacyl derivatives, Chem. Pap., 1988, 42, 3, 375-380. [all data]