Methyl 4-fluorobenzoate

Van Den Dool and Kratz RI, non-polar column, custom temperature program

Data compiled by: NIST Mass Spectrometry Data Center, William E. Wallace, director

Column type Packed
Active phase SE-30
Column length (m) 3.05
Carrier gas
Substrate Supelcoport; Chromosorb
Column diameter (mm)
Phase thickness (μm)
Program 40C(5min) => 10C/min => 200C or 250C (60min)
I 1062.
ReferencePeng, Ding, et al., 1988
Comment MSDC-RI

Kovats' RI, non-polar column, isothermal

View large format table.

Column type Active phase Temperature (C) I Reference Comment
PackedApiezon L180.1074.Vernon and Edwards, 1975N2, Celite; Column length: 1. m

References

Peng, Ding, et al., 1988
Peng, C.T.; Ding, S.F.; Hua, R.L.; Yang, Z.C., Prediction of Retention Indexes I. Structure-Retention Index Relationship on Apolar Columns, J. Chromatogr., 1988, 436, 137-172, https://doi.org/10.1016/S0021-9673(00)94575-8 . [all data]