(E)-1-Propene-1,2,3-tricarboxylic acid

Phase change data

Data compiled by: Thermodynamics Research Center, NIST Boulder Laboratories, Chris Muzny director

Quantity Value Units Method Reference Comment
Tfus455.75KN/AWilhoit and Lei, 1965Uncertainty assigned by TRC = 0.8 K; with some decomposition
Tfus456.45KN/AWilhoit and Lei, 1965Uncertainty assigned by TRC = 0.6 K

In addition to the Thermodynamics Research Center (TRC) data available from this site, much more physical and chemical property data is available from the following TRC products:

Condensed phase thermochemistry data

Data compiled by: Hussein Y. Afeefy, Joel F. Liebman, and Stephen E. Stein

Quantity Value Units Method Reference Comment
Δfsolid-1233. ± 3.kJ/molCcbWilhoit and Lei, 1965
Quantity Value Units Method Reference Comment
Δcsolid-1985.8 ± 2.5kJ/molCcbWilhoit and Lei, 1965Corresponding Δfsolid = -1232.7 kJ/mol (simple calculation by NIST; no Washburn corrections)

References

Wilhoit and Lei, 1965
Wilhoit, R.C.; Lei, I., Thermochemistry of Biologically Important Compounds. Heats of Combustion of Five Organic Acids, J. Chem. Eng. Data, 1965, 10, 166. [all data]