Butane, 2,3-dimethyl-2,3-dinitro-

Condensed phase thermochemistry data

Data compiled by: Hussein Y. Afeefy, Joel F. Liebman, and Stephen E. Stein

Quantity Value Units Method Reference Comment
Δfsolid-311. ± 1.kJ/molCcbLebedeva and Ryadnenko, 1968
Quantity Value Units Method Reference Comment
Δcsolid-3765. ± 1.kJ/molCcbLebedeva and Ryadnenko, 1968
Δcsolid-3855.1 ± 6.7kJ/molCcbMiller and Hunt, 1945Reanalyzed by Cox and Pilcher, 1970, Original value = -3858. ± 6.7 kJ/mol

References

Lebedeva and Ryadnenko, 1968
Lebedeva, N.D.; Ryadnenko, V.L., Heats of combustion and formation of polynitroalkanes, Russ. J. Phys. Chem. (Engl. Transl.), 1968, 42, 1225-1227. [all data]

Miller and Hunt, 1945
Miller, A.J.; Hunt, H., Heats of combustion. III The heats of combustion of some polynitroparaffins, J. Phys. Chem., 1945, 49, 20-21. [all data]

Cox and Pilcher, 1970
Cox, J.D.; Pilcher, G., Thermochemistry of Organic and Organometallic Compounds, Academic Press, New York, 1970, 1-636. [all data]