3-Cyclobutene-1,2-dione, 3-phenyl-

Condensed phase thermochemistry data

Data compiled by: Hussein Y. Afeefy, Joel F. Liebman, and Stephen E. Stein

Quantity Value Units Method Reference Comment
Δfsolid-84.18kJ/molCcbKrall and Roberts, 1958
Quantity Value Units Method Reference Comment
Δcsolid-4708.46 ± 0.71kJ/molCcbSmutny, Caserio, et al., 1960Unpublished result of R. E. Krall; Corresponding Δfsolid = -84.14 kJ/mol (simple calculation by NIST; no Washburn corrections)
Δcsolid-4708.46 ± 0.71kJ/molCcbKrall and Roberts, 1958Corresponding Δfsolid = -84.14 kJ/mol (simple calculation by NIST; no Washburn corrections)

Phase change data

Data compiled by: Hussein Y. Afeefy, Joel F. Liebman, and Stephen E. Stein

Quantity Value Units Method Reference Comment
Δsub13.00 ± 0.10kcal/molVSmutny, Caserio, et al., 1960Unpublished result of R. E. Krall
Δsub13.0kcal/molEKrall and Roberts, 1958

References

Krall and Roberts, 1958
Krall, R.E.; Roberts, J.D., Strain variation in the unsaturated cyclobutane ring, Am. Chem. Soc. Div. Pet. Chem., 1958, 3, 63-68. [all data]

Smutny, Caserio, et al., 1960
Smutny, E.J.; Caserio, M.C.; Roberts, J.D., Small-ring compounds. XXV. Phenylcyclobutadienoquinone and related compounds, J. Am. Chem. Soc., 1960, 82, 1793-1801. [all data]