2-Hydroxymethyl-1,3-dioxane

Phase change data

Data compiled as indicated in comments:
ALS - Hussein Y. Afeefy, Joel F. Liebman, and Stephen E. Stein
DRB - Donald R. Burgess, Jr.

Quantity Value Units Method Reference Comment
Δvap16.5 ± 0.48kcal/molEPihlaja and Gelas, 1975ALS
Δvap16.5kcal/molN/APihlaja and Gelas, 1975DRB

References

Pihlaja and Gelas, 1975
Pihlaja, K.; Gelas, J., Bond-bond interactions in organic oxygen compounds. VI. Enthalpies of formation of 2-hydroxymethyl-1,3-dioxane and 2-(1-hydroxy-1-methylethyl)-1-methyl-1,3-dioxane. Influence of an intramolecular hydrogen bond on thermochemical stability in the gaseous state, Finn. Chem. Lett., 1975, 79-82. [all data]