1,1'-Biphenyl, 2,2',3,5',6-pentachloro-

Van Den Dool and Kratz RI, non-polar column, temperature ramp

View large format table.

Column type Active phase I Reference Comment
CapillaryCP Sil 5 CB2003.Wells, Gillespie, et al., 1985120. C @ 1. min, 3. K/min; Column length: 25. m; Column diameter: 0.22 mm; Tend: 250. C

Normal alkane RI, non-polar column, isothermal

View large format table.

Column type Active phase Temperature (C) I Reference Comment
CapillaryApiezon L180.2048.Ballschmiter and Zell, 1980H2; Column length: 40. m; Column diameter: 0.30 mm
CapillaryApiezon L180.2048.Ballschmiter and Zell, 1980H2; Column length: 40. m; Column diameter: 0.30 mm
CapillaryApiezon L180.2048.Ballschmiter and Zell, 1980H2; Column length: 40. m; Column diameter: 0.30 mm
CapillaryApiezon L205.2089.Sissons and Welti, 1971He; Column length: 15. m; Column diameter: 0.20 mm

Normal alkane RI, non-polar column, custom temperature program

View large format table.

Column type Active phase I Reference Comment
CapillaryOV-1, SE-30, Methyl silicone, SP-2100, OV-101, DB-1, etc.2003.Waggott and Davies, 1984Hydrogen; Column length: 50. m; Column diameter: 0.32 mm; Program: not specified

References

Wells, Gillespie, et al., 1985
Wells, D.E.; Gillespie, M.J.; Porter, A.E.A., Dichlorobenzyl alkyl ether homologs as retention index markers and internal standards for the analysis of environmental samples using capillary gas chromatography, J. Hi. Res. Chromatogr. Chromatogr. Comm., 1985, 8, 8, 443-449, https://doi.org/10.1002/jhrc.1240080818 . [all data]

Ballschmiter and Zell, 1980
Ballschmiter, K.; Zell, M., Analysis of polychlorinated biphenyls (PCB) by glass capillary gas chromatography, Fresenius Z. Anal. Chem., 1980, 302, 1, 20-31, https://doi.org/10.1007/BF00469758 . [all data]

Sissons and Welti, 1971
Sissons, D.; Welti, D., Structural Identification of Polychlorinated Biphenyls in Commercial Mixtures by Gas-Liquid Chromatography, Nuclear Magnetic Resonance and Mass Spectrometry, J. Chromatogr., 1971, 60, 15-32, https://doi.org/10.1016/S0021-9673(00)95526-2 . [all data]

Waggott and Davies, 1984
Waggott, A.; Davies, I.W., Identification of organic pollutants using linear temperature programmed retention indices (LTPRIs) - Part II, 1984, retrieved from http://dwi.defra.gov.uk/research/completed-research/reports/dwi0383.pdf. [all data]