4,7-Ethano-1H-indene, octahydro-

Gas phase ion energetics data

Data compiled by: Sharon G. Lias, Rhoda D. Levin, and Sherif A. Kafafi

Ionization energy determinations

IE (eV) Method Reference
9.15PIFedorova, Potapov, et al., 1974

References

Fedorova, Potapov, et al., 1974
Fedorova, M.S.; Potapov, V.K.; Denisov, Yu.V.; Sorokin, V.V.; Evlasheva, T.I., A mass-spectrometric study of the photoionisation of certain cyclic hydrocarbons, Russ. J. Phys. Chem., 1974, 48, 1078, In original 1828. [all data]