Benzenamine, 2,5-difluoro-

Phase change data

Data compiled as indicated in comments:
BS - Robert L. Brown and Stephen E. Stein
AC - William E. Acree, Jr., James S. Chickos

Quantity Value Units Method Reference Comment
Tboil450.2KN/AAldrich Chemical Company Inc., 1990BS
Tboil449. - 451.KN/APCR Inc., 1990BS
Quantity Value Units Method Reference Comment
Δvap52.5 ± 0.5kJ/molCRibeiro da Silva, Ferreira, et al., 2007AC

References

Aldrich Chemical Company Inc., 1990
Aldrich Chemical Company Inc., Catalog Handbook of Fine Chemicals, Aldrich Chemical Company, Inc., Milwaukee WI, 1990, 1. [all data]

PCR Inc., 1990
PCR Inc., Research Chemicals Catalog 1990-1991, PCR Inc., Gainesville, FL, 1990, 1. [all data]

Ribeiro da Silva, Ferreira, et al., 2007
Ribeiro da Silva, Manuel A.V.; Ferreira, Ana I.M.C.L.; Gomes, José R.B., Combined Experimental and Computational Study of the Thermochemistry of the Fluoroaniline Isomers, J. Phys. Chem. B, 2007, 111, 8, 2052-2061, https://doi.org/10.1021/jp0672407 . [all data]