Germane, tetrapentyl-

Phase change data

Antoine Equation Parameters

log10(P) = A − (B / (T + C))
    P = vapor pressure (bar)
    T = temperature (K)

View plot Requires a JavaScript / HTML 5 canvas capable browser.

Temperature (K) A B C Reference Comment
471.09 - 599.393.823581638.038-170.369Mogul, Hochberg, et al., 1974Coefficents calculated by NIST from author's data.

References

Mogul, Hochberg, et al., 1974
Mogul, Philip H.; Hochberg, Marc C.; Michiel, Robert; Nestel, Glenn K.; Wamsley, Brian L.; Coren, Seth D., Physical properties of tetra-n-alkylgermanes (C1-C6), J. Chem. Eng. Data, 1974, 19, 1, 4-6, https://doi.org/10.1021/je60060a029 . [all data]