Methylenedioxyamphetamine acetate

Kovats' RI, non-polar column, temperature ramp

View large format table.

Column type Active phase I Reference Comment
CapillaryCross-Linked Methylsilicone1860.Ensslin, Kovar, et al., 199612. m/0.2 mm/0.33 μm, He, 100. C @ 3. min, 30. K/min, 310. C @ 8. min

References

Ensslin, Kovar, et al., 1996
Ensslin, H.K.; Kovar, K.-A.; Maurer, H.H., Toxicological detection of the designer drug 3,4-methylenedioxyethylamphetamine (MDE, Eve) and its metabolites in urine by gas chromatography-mass spectrometry and fluorescence polarization immunoassay, J. Chromatogr. B, 1996, 683, 2, 189-197, https://doi.org/10.1016/0378-4347(96)00129-6 . [all data]