Cyclotetradecanone-

Phase change data

Data compiled by: Hussein Y. Afeefy, Joel F. Liebman, and Stephen E. Stein

Enthalpy of sublimation

ΔsubH (kJ/mol) Temperature (K) Method Reference
80.8 ± 0.8310.VWolf and Weghofer, 1938

References

Wolf and Weghofer, 1938
Wolf, K.L.; Weghofer, H., Uber sublimationswarmen, Z. Phys. Chem., 1938, 39, 194-208. [all data]